Page MenuHome GnuPG

(An Untitled Masterwork)
ActivePublic

Authored by aheinecke on Thu, Feb 8, 1:31 PM.
[ 26%] Building CXX object src/network/CMakeFiles/Network.dir/Network_autogen/mocs_compilation.cpp.obj
In file included from /usr/lib64/gcc/i686-w64-mingw32/13.2.0/include/c++/bits/postypes.h:40,
from /usr/lib64/gcc/i686-w64-mingw32/13.2.0/include/c++/iosfwd:42,
from /usr/lib64/gcc/i686-w64-mingw32/13.2.0/include/c++/bits/stream_iterator.h:35,
from /usr/lib64/gcc/i686-w64-mingw32/13.2.0/include/c++/iterator:65,
from /home/aheinecke/dev/main/src/gpg4win/src/playground/build/qtbase-6.6.1-build/include/QtCore/../../../qtbase-6.6.1/src/corelib/tools/qcontainertools_impl.h:20,
from /home/aheinecke/dev/main/src/gpg4win/src/playground/build/qtbase-6.6.1-build/include/QtCore/qcontainertools_impl.h:1,
from /home/aheinecke/dev/main/src/gpg4win/src/playground/build/qtbase-6.6.1-build/include/QtCore/../../../qtbase-6.6.1/src/corelib/tools/qarraydataops.h:9,
from /home/aheinecke/dev/main/src/gpg4win/src/playground/build/qtbase-6.6.1-build/include/QtCore/qarraydataops.h:1,
from /home/aheinecke/dev/main/src/gpg4win/src/playground/build/qtbase-6.6.1-build/include/QtCore/../../../qtbase-6.6.1/src/corelib/tools/qarraydatapointer.h:7,
from /home/aheinecke/dev/main/src/gpg4win/src/playground/build/qtbase-6.6.1-build/include/QtCore/qarraydatapointer.h:1,
from /home/aheinecke/dev/main/src/gpg4win/src/playground/build/qtbase-6.6.1-build/include/QtCore/../../../qtbase-6.6.1/src/corelib/tools/qlist.h:8,
from /home/aheinecke/dev/main/src/gpg4win/src/playground/build/qtbase-6.6.1-build/include/QtCore/qlist.h:1,
from /home/aheinecke/dev/main/src/gpg4win/src/playground/build/qtbase-6.6.1-build/include/QtCore/../../../qtbase-6.6.1/src/corelib/tools/qversionnumber.h:9,
from /home/aheinecke/dev/main/src/gpg4win/src/playground/build/qtbase-6.6.1-build/include/QtCore/qversionnumber.h:1,
from /home/aheinecke/dev/main/src/gpg4win/src/playground/build/qtbase-6.6.1-build/include/QtCore/../../../qtbase-6.6.1/src/corelib/global/qoperatingsystemversion.h:5,
from /home/aheinecke/dev/main/src/gpg4win/src/playground/build/qtbase-6.6.1-build/include/QtCore/qoperatingsystemversion.h:1,
from /home/aheinecke/dev/main/src/gpg4win/src/playground/build/qtbase-6.6.1-build/include/QtCore/6.6.1/QtCore/private/../../../../../../qtbase-6.6.1/src/corelib/global/qglobal_p.h:63,
from /home/aheinecke/dev/main/src/gpg4win/src/playground/build/qtbase-6.6.1-build/include/QtCore/6.6.1/QtCore/private/qglobal_p.h:1,
from /home/aheinecke/dev/main/src/gpg4win/src/playground/build/qtbase-6.6.1-build/include/QtNetwork/6.6.1/QtNetwork/private/../../../../../../qtbase-6.6.1/src/network/kernel/qtnetworkglobal_p.h:19,
from /home/aheinecke/dev/main/src/gpg4win/src/playground/build/qtbase-6.6.1-build/include/QtNetwork/6.6.1/QtNetwork/private/qtnetworkglobal_p.h:1,
from /home/aheinecke/dev/main/src/gpg4win/src/playground/build/qtbase-6.6.1-build/src/network/Network_autogen/7GB2EGQPHR/../../../../../qtbase-6.6.1/src/network/kernel/qnetconmonitor_p.h:7,
from /home/aheinecke/dev/main/src/gpg4win/src/playground/build/qtbase-6.6.1-build/src/network/Network_autogen/7GB2EGQPHR/moc_qnetconmonitor_p.cpp:9,
from /home/aheinecke/dev/main/src/gpg4win/src/playground/build/qtbase-6.6.1-build/src/network/Network_autogen/mocs_compilation.cpp:2:
/usr/lib64/gcc/i686-w64-mingw32/13.2.0/include/c++/cwchar:148:11: error: 'fwide' has not been declared in '::'
148 | using ::fwide;
| ^~~~~
/usr/lib64/gcc/i686-w64-mingw32/13.2.0/include/c++/cwchar:149:11: error: 'fwprintf' has not been declared in '::'
149 | using ::fwprintf;
| ^~~~~~~~
/usr/lib64/gcc/i686-w64-mingw32/13.2.0/include/c++/cwchar:150:11: error: 'fwscanf' has not been declared in '::'
150 | using ::fwscanf;
| ^~~~~~~
/usr/lib64/gcc/i686-w64-mingw32/13.2.0/include/c++/cwchar:160:11: error: 'swprintf' has not been declared in '::'
160 | using ::swprintf;
| ^~~~~~~~
/usr/lib64/gcc/i686-w64-mingw32/13.2.0/include/c++/cwchar:162:11: error: 'swscanf' has not been declared in '::'
162 | using ::swscanf;
| ^~~~~~~
/usr/lib64/gcc/i686-w64-mingw32/13.2.0/include/c++/cwchar:164:11: error: 'vfwprintf' has not been declared in '::'
164 | using ::vfwprintf;
| ^~~~~~~~~
/usr/lib64/gcc/i686-w64-mingw32/13.2.0/include/c++/cwchar:169:11: error: 'vswprintf' has not been declared in '::'
169 | using ::vswprintf;
| ^~~~~~~~~
/usr/lib64/gcc/i686-w64-mingw32/13.2.0/include/c++/cwchar:174:11: error: 'vwprintf' has not been declared in '::'
174 | using ::vwprintf;
| ^~~~~~~~
/usr/lib64/gcc/i686-w64-mingw32/13.2.0/include/c++/cwchar:204:11: error: 'wprintf' has not been declared in '::'
204 | using ::wprintf;
| ^~~~~~~
/usr/lib64/gcc/i686-w64-mingw32/13.2.0/include/c++/cwchar:205:11: error: 'wscanf' has not been declared in '::'
205 | using ::wscanf;
| ^~~~~~
In file included from /usr/lib64/gcc/i686-w64-mingw32/13.2.0/include/c++/i686-w64-mingw32/bits/gthr.h:148,
from /usr/lib64/gcc/i686-w64-mingw32/13.2.0/include/c++/ext/atomicity.h:35,
from /usr/lib64/gcc/i686-w64-mingw32/13.2.0/include/c++/bits/ios_base.h:39,
from /usr/lib64/gcc/i686-w64-mingw32/13.2.0/include/c++/streambuf:43,
from /usr/lib64/gcc/i686-w64-mingw32/13.2.0/include/c++/bits/streambuf_iterator.h:35,
from /usr/lib64/gcc/i686-w64-mingw32/13.2.0/include/c++/iterator:66:
/usr/lib64/gcc/i686-w64-mingw32/13.2.0/include/c++/i686-w64-mingw32/bits/gthr-default.h: In function 'int __gthread_mutex_timedlock(__gthread_mutex_t*, const __gthread_time_t*)':
/usr/lib64/gcc/i686-w64-mingw32/13.2.0/include/c++/i686-w64-mingw32/bits/gthr-default.h:769:12: error: 'pthread_mutex_timedlock' was not declared in this scope; did you mean 'pthread_mutex_trylock'?
769 | return __gthrw_(pthread_mutex_timedlock) (__mutex, __abs_timeout);
| ^~~~~~~~
/usr/lib64/gcc/i686-w64-mingw32/13.2.0/include/c++/i686-w64-mingw32/bits/gthr-default.h: In function 'int __gthread_recursive_mutex_init_function(__gthread_recursive_mutex_t*)':
/usr/lib64/gcc/i686-w64-mingw32/13.2.0/include/c++/i686-w64-mingw32/bits/gthr-default.h:797:52: error: 'PTHREAD_MUTEX_RECURSIVE' was not declared in this scope; did you mean 'PTHREAD_MUTEX_RECURSIVE_NP'?
797 | PTHREAD_MUTEX_RECURSIVE);
| ^~~~~~~~~~~~~~~~~~~~~~~
| PTHREAD_MUTEX_RECURSIVE_NP
/usr/lib64/gcc/i686-w64-mingw32/13.2.0/include/c++/i686-w64-mingw32/bits/gthr-default.h:796:15: error: 'pthread_mutexattr_settype' was not declared in this scope; did you mean 'pthread_mutexattr_destroy'?
796 | __r = __gthrw_(pthread_mutexattr_settype) (&__attr,
| ^~~~~~~~
In file included from /usr/lib64/gcc/i686-w64-mingw32/13.2.0/include/c++/string:54,
from /usr/lib64/gcc/i686-w64-mingw32/13.2.0/include/c++/bits/locale_classes.h:40,
from /usr/lib64/gcc/i686-w64-mingw32/13.2.0/include/c++/bits/ios_base.h:41:
/usr/lib64/gcc/i686-w64-mingw32/13.2.0/include/c++/bits/basic_string.h: In function 'std::wstring std::__cxx11::to_wstring(int)':
/usr/lib64/gcc/i686-w64-mingw32/13.2.0/include/c++/bits/basic_string.h:4302:51: error: 'vswprintf' is not a member of 'std'; did you mean 'vsprintf'?
4302 | { return __gnu_cxx::__to_xstring<wstring>(&std::vswprintf, 4 * sizeof(int),
| ^~~~~~~~~
| vsprintf
/usr/lib64/gcc/i686-w64-mingw32/13.2.0/include/c++/bits/basic_string.h: In function 'std::wstring std::__cxx11::to_wstring(unsigned int)':
/usr/lib64/gcc/i686-w64-mingw32/13.2.0/include/c++/bits/basic_string.h:4308:51: error: 'vswprintf' is not a member of 'std'; did you mean 'vsprintf'?
4308 | { return __gnu_cxx::__to_xstring<wstring>(&std::vswprintf,
| ^~~~~~~~~
| vsprintf
/usr/lib64/gcc/i686-w64-mingw32/13.2.0/include/c++/bits/basic_string.h: In function 'std::wstring std::__cxx11::to_wstring(long int)':
/usr/lib64/gcc/i686-w64-mingw32/13.2.0/include/c++/bits/basic_string.h:4315:51: error: 'vswprintf' is not a member of 'std'; did you mean 'vsprintf'?
4315 | { return __gnu_cxx::__to_xstring<wstring>(&std::vswprintf, 4 * sizeof(long),
| ^~~~~~~~~
| vsprintf
/usr/lib64/gcc/i686-w64-mingw32/13.2.0/include/c++/bits/basic_string.h: In function 'std::wstring std::__cxx11::to_wstring(long unsigned int)':
/usr/lib64/gcc/i686-w64-mingw32/13.2.0/include/c++/bits/basic_string.h:4321:51: error: 'vswprintf' is not a member of 'std'; did you mean 'vsprintf'?
4321 | { return __gnu_cxx::__to_xstring<wstring>(&std::vswprintf,
| ^~~~~~~~~
| vsprintf
/usr/lib64/gcc/i686-w64-mingw32/13.2.0/include/c++/bits/basic_string.h: In function 'std::wstring std::__cxx11::to_wstring(long long int)':
/usr/lib64/gcc/i686-w64-mingw32/13.2.0/include/c++/bits/basic_string.h:4328:51: error: 'vswprintf' is not a member of 'std'; did you mean 'vsprintf'?
4328 | { return __gnu_cxx::__to_xstring<wstring>(&std::vswprintf,
| ^~~~~~~~~
| vsprintf
/usr/lib64/gcc/i686-w64-mingw32/13.2.0/include/c++/bits/basic_string.h: In function 'std::wstring std::__cxx11::to_wstring(long long unsigned int)':
/usr/lib64/gcc/i686-w64-mingw32/13.2.0/include/c++/bits/basic_string.h:4335:51: error: 'vswprintf' is not a member of 'std'; did you mean 'vsprintf'?
4335 | { return __gnu_cxx::__to_xstring<wstring>(&std::vswprintf,
| ^~~~~~~~~
| vsprintf
/usr/lib64/gcc/i686-w64-mingw32/13.2.0/include/c++/bits/basic_string.h: In function 'std::wstring std::__cxx11::to_wstring(float)':
/usr/lib64/gcc/i686-w64-mingw32/13.2.0/include/c++/bits/basic_string.h:4345:51: error: 'vswprintf' is not a member of 'std'; did you mean 'vsprintf'?
4345 | return __gnu_cxx::__to_xstring<wstring>(&std::vswprintf, __n,
| ^~~~~~~~~
| vsprintf
/usr/lib64/gcc/i686-w64-mingw32/13.2.0/include/c++/bits/basic_string.h: In function 'std::wstring std::__cxx11::to_wstring(double)':
/usr/lib64/gcc/i686-w64-mingw32/13.2.0/include/c++/bits/basic_string.h:4355:51: error: 'vswprintf' is not a member of 'std'; did you mean 'vsprintf'?
4355 | return __gnu_cxx::__to_xstring<wstring>(&std::vswprintf, __n,
| ^~~~~~~~~
| vsprintf
/usr/lib64/gcc/i686-w64-mingw32/13.2.0/include/c++/bits/basic_string.h: In function 'std::wstring std::__cxx11::to_wstring(long double)':
/usr/lib64/gcc/i686-w64-mingw32/13.2.0/include/c++/bits/basic_string.h:4365:51: error: 'vswprintf' is not a member of 'std'; did you mean 'vsprintf'?
4365 | return __gnu_cxx::__to_xstring<wstring>(&std::vswprintf, __n,
| ^~~~~~~~~
| vsprintf
make[2]: *** [src/network/CMakeFiles/Network.dir/build.make:99: src/network/CMakeFiles/Network.dir/Network_autogen/mocs_compilation.cpp.obj] Error 1
make[1]: *** [CMakeFiles/Makefile2:4301: src/network/CMakeFiles/Network.dir/all] Error 2
make: *** [Makefile:146: all] Error 2